[Geany-devel] Nightly build failed: Plugins GTK 2.8 build test

nightly.geany.org enrico.troeger at xxxxx
Fri Jul 17 03:48:41 UTC 2009

Plugins GTK 2.8 build test failed at: waf build

See http://nightly.geany.org/misc/build_gtk28_plugins_stderr.log for details.

Last error message:
../../gtk28_test_plugins/addons/src/addons.c:129: error: expected ')' before '*' token
../../gtk28_test_plugins/addons/src/addons.c:176: error: expected declaration specifiers before 'GtkWidget'
../../gtk28_test_plugins/addons/src/addons.c:215:24: error: missing binary operator before token "("
../../gtk28_test_plugins/addons/src/addons.c:224: error: expected '=', ',', ';', 'asm' or '__attribute__' before '{' token
../../gtk28_test_plugins/addons/src/addons.c:233: error: expected '{' at end of input
Build failed
 -> task failed (err #1): 
	{task: cc addons.c -> addons_1.o}


More information about the Devel mailing list